Please support VectorLinux!

Author Topic: help on compile error xorg 1.6  (Read 854 times)

marduk

  • Member
  • *
  • Posts: 6
help on compile error xorg 1.6
« on: April 25, 2010, 08:49:01 pm »
rrcrtc.c: In function 'ProcRRGetPanning':
rrcrtc.c:996: error: 'xRRGetPanningReq' undeclared (first use in this function)
rrcrtc.c:996: error: (Each undeclared identifier is reported only once
rrcrtc.c:996: error: for each function it appears in.)
rrcrtc.c:996: error: 'stuff' undeclared (first use in this function)
rrcrtc.c:996: error: expected expression before ')' token
rrcrtc.c:997: error: 'xRRGetPanningReply' undeclared (first use in this function)
rrcrtc.c:997: error: expected ';' before 'rep'
rrcrtc.c:1021: error: 'rep' undeclared (first use in this function)
rrcrtc.c: In function 'ProcRRSetPanning':
rrcrtc.c:1068: error: 'xRRSetPanningReq' undeclared (first use in this function)
rrcrtc.c:1068: error: 'stuff' undeclared (first use in this function)
rrcrtc.c:1068: error: expected expression before ')' token
rrcrtc.c:1069: error: 'xRRSetPanningReply' undeclared (first use in this function)
rrcrtc.c:1069: error: expected ';' before 'rep'
rrcrtc.c:1094: error: 'rep' undeclared (first use in this function)
make[1]: *** [rrcrtc.lo] Error 1
make[1]: Leaving directory `/bla
make: *** [all-recursive] Error 1

please point to a site that has what all that mess means
« Last Edit: April 25, 2010, 08:51:04 pm by marduk »