VectorLinux
October 21, 2014, 05:18:33 pm *
Welcome, Guest. Please login or register.
Did you miss your activation email?

Login with username, password and session length
News: Visit our home page for VL info. To search the old message board go to http://vectorlinux.com/forum1. The first VL forum is temporarily offline until we can find a host for it. Thanks for your patience.
 
Now powered by KnowledgeDex.
   Home   Help Search Login Register  
Please support VectorLinux!
Pages: 1 [2]
  Print  
Author Topic: 090212 midori-0.1.2 and WebKit-r40738 [VL 6.0]  (Read 3503 times)
kc1di
Packager
Vectorian
****
Posts: 1125


Morse Code Early digital mode. John 3:16


« Reply #15 on: March 27, 2009, 04:51:05 am »

Ok.. I will upload mine.
I had no errors at all, and I've tested them on my 2 computers @ home + one at work, they seem fine.



Thanks Moe
My error seems to be related to libsoup  Just won't have the time to work on it in the next week or so. next week is looking very busy for me.

here's the error code I'm getting:

Code:
usr/lib/libgobject-2.0.so /usr/lib/libgmodule-2.0.so -ldl /usr/lib/libglib-2.0.so -pthread
./.libs/libwebkit-1.0.so: undefined reference to `soup_message_headers_get_content_length'
./.libs/libwebkit-1.0.so: undefined reference to `soup_cookie_jar_new'
./.libs/libwebkit-1.0.so: undefined reference to `soup_cookie_jar_set_cookie'
./.libs/libwebkit-1.0.so: undefined reference to `soup_message_body_append'
./.libs/libwebkit-1.0.so: undefined reference to `_SOUP_URI_SCHEME_HTTP'
./.libs/libwebkit-1.0.so: undefined reference to `soup_message_body_set_accumulate'
./.libs/libwebkit-1.0.so: undefined reference to `soup_logger_attach'
./.libs/libwebkit-1.0.so: undefined reference to `soup_session_get_feature'
./.libs/libwebkit-1.0.so: undefined reference to `soup_session_unpause_message'
./.libs/libwebkit-1.0.so: undefined reference to `soup_session_queue_message'
./.libs/libwebkit-1.0.so: undefined reference to `soup_message_headers_set_content_type'
./.libs/libwebkit-1.0.so: undefined reference to `soup_uri_new'
./.libs/libwebkit-1.0.so: undefined reference to `soup_uri_free'
./.libs/libwebkit-1.0.so: undefined reference to `soup_message_headers_iter_init'
./.libs/libwebkit-1.0.so: undefined reference to `soup_message_headers_append'
./.libs/libwebkit-1.0.so: undefined reference to `soup_buffer_free'
./.libs/libwebkit-1.0.so: undefined reference to `soup_session_pause_message'
./.libs/libwebkit-1.0.so: undefined reference to `soup_logger_new'
./.libs/libwebkit-1.0.so: undefined reference to `soup_message_set_request'
./.libs/libwebkit-1.0.so: undefined reference to `soup_message_get_type'
./.libs/libwebkit-1.0.so: undefined reference to `soup_message_new'
./.libs/libwebkit-1.0.so: undefined reference to `soup_message_get_uri'
./.libs/libwebkit-1.0.so: undefined reference to `soup_cookie_jar_get_cookies'
./.libs/libwebkit-1.0.so: undefined reference to `soup_message_headers_iter_next'
./.libs/libwebkit-1.0.so: undefined reference to `soup_session_cancel_message'
./.libs/libwebkit-1.0.so: undefined reference to `soup_uri_to_string'
./.libs/libwebkit-1.0.so: undefined reference to `soup_logger_get_type'
./.libs/libwebkit-1.0.so: undefined reference to `soup_message_set_uri'
./.libs/libwebkit-1.0.so: undefined reference to `soup_buffer_new_with_owner'
./.libs/libwebkit-1.0.so: undefined reference to `soup_session_add_feature'
./.libs/libwebkit-1.0.so: undefined reference to `soup_message_headers_get_content_type'
./.libs/libwebkit-1.0.so: undefined reference to `soup_session_async_new'
./.libs/libwebkit-1.0.so: undefined reference to `soup_auth_authenticate'
./.libs/libwebkit-1.0.so: undefined reference to `soup_message_headers_get'
./.libs/libwebkit-1.0.so: undefined reference to `_SOUP_URI_SCHEME_HTTPS'
./.libs/libwebkit-1.0.so: undefined reference to `soup_message_body_append_buffer'
./.libs/libwebkit-1.0.so: undefined reference to `soup_session_feature_get_type'
./.libs/libwebkit-1.0.so: undefined reference to `soup_cookie_jar_get_type'
collect2: ld returned 1 exit status
make[1]: *** [Programs/GtkLauncher] Error 1
make[1]: *** Waiting for unfinished jobs....
./.libs/libwebkit-1.0.so: undefined reference to `soup_message_headers_get_content_length'
./.libs/libwebkit-1.0.so: undefined reference to `soup_cookie_jar_new'
./.libs/libwebkit-1.0.so: undefined reference to `soup_cookie_jar_set_cookie'
./.libs/libwebkit-1.0.so: undefined reference to `soup_message_body_append'
./.libs/libwebkit-1.0.so: undefined reference to `_SOUP_URI_SCHEME_HTTP'
./.libs/libwebkit-1.0.so: undefined reference to `soup_message_body_set_accumulate'
./.libs/libwebkit-1.0.so: undefined reference to `soup_logger_attach'
./.libs/libwebkit-1.0.so: undefined reference to `soup_session_get_feature'
./.libs/libwebkit-1.0.so: undefined reference to `soup_session_unpause_message'
./.libs/libwebkit-1.0.so: undefined reference to `soup_session_queue_message'
./.libs/libwebkit-1.0.so: undefined reference to `soup_message_headers_set_content_type'
./.libs/libwebkit-1.0.so: undefined reference to `soup_uri_new'
./.libs/libwebkit-1.0.so: undefined reference to `soup_uri_free'
./.libs/libwebkit-1.0.so: undefined reference to `soup_message_headers_iter_init'
./.libs/libwebkit-1.0.so: undefined reference to `soup_message_headers_append'
./.libs/libwebkit-1.0.so: undefined reference to `soup_buffer_free'
./.libs/libwebkit-1.0.so: undefined reference to `soup_session_pause_message'
./.libs/libwebkit-1.0.so: undefined reference to `soup_logger_new'
./.libs/libwebkit-1.0.so: undefined reference to `soup_message_set_request'
./.libs/libwebkit-1.0.so: undefined reference to `soup_message_get_type'
./.libs/libwebkit-1.0.so: undefined reference to `soup_message_new'
./.libs/libwebkit-1.0.so: undefined reference to `soup_message_get_uri'
./.libs/libwebkit-1.0.so: undefined reference to `soup_cookie_jar_get_cookies'
./.libs/libwebkit-1.0.so: undefined reference to `soup_message_headers_iter_next'
./.libs/libwebkit-1.0.so: undefined reference to `soup_session_cancel_message'
./.libs/libwebkit-1.0.so: undefined reference to `soup_uri_to_string'
./.libs/libwebkit-1.0.so: undefined reference to `soup_logger_get_type'
./.libs/libwebkit-1.0.so: undefined reference to `soup_message_set_uri'
./.libs/libwebkit-1.0.so: undefined reference to `soup_buffer_new_with_owner'
./.libs/libwebkit-1.0.so: undefined reference to `soup_session_add_feature'
./.libs/libwebkit-1.0.so: undefined reference to `soup_message_headers_get_content_type'
./.libs/libwebkit-1.0.so: undefined reference to `soup_session_async_new'
./.libs/libwebkit-1.0.so: undefined reference to `soup_auth_authenticate'
./.libs/libwebkit-1.0.so: undefined reference to `soup_message_headers_get'
./.libs/libwebkit-1.0.so: undefined reference to `_SOUP_URI_SCHEME_HTTPS'
./.libs/libwebkit-1.0.so: undefined reference to `soup_message_body_append_buffer'
./.libs/libwebkit-1.0.so: undefined reference to `soup_session_feature_get_type'
./.libs/libwebkit-1.0.so: undefined reference to `soup_cookie_jar_get_type'
collect2: ld returned 1 exit status
make[1]: *** [Programs/UnitTests] Error 1
./.libs/libwebkit-1.0.so: undefined reference to `soup_message_headers_get_content_length'
./.libs/libwebkit-1.0.so: undefined reference to `soup_cookie_jar_new'
./.libs/libwebkit-1.0.so: undefined reference to `soup_cookie_jar_set_cookie'
./.libs/libwebkit-1.0.so: undefined reference to `soup_message_body_append'
./.libs/libwebkit-1.0.so: undefined reference to `_SOUP_URI_SCHEME_HTTP'
./.libs/libwebkit-1.0.so: undefined reference to `soup_message_body_set_accumulate'
./.libs/libwebkit-1.0.so: undefined reference to `soup_logger_attach'
./.libs/libwebkit-1.0.so: undefined reference to `soup_session_get_feature'
./.libs/libwebkit-1.0.so: undefined reference to `soup_session_unpause_message'
./.libs/libwebkit-1.0.so: undefined reference to `soup_session_queue_message'
./.libs/libwebkit-1.0.so: undefined reference to `soup_message_headers_set_content_type'
./.libs/libwebkit-1.0.so: undefined reference to `soup_uri_new'
./.libs/libwebkit-1.0.so: undefined reference to `soup_uri_free'
./.libs/libwebkit-1.0.so: undefined reference to `soup_message_headers_iter_init'
./.libs/libwebkit-1.0.so: undefined reference to `soup_message_headers_append'
./.libs/libwebkit-1.0.so: undefined reference to `soup_buffer_free'
./.libs/libwebkit-1.0.so: undefined reference to `soup_session_pause_message'
./.libs/libwebkit-1.0.so: undefined reference to `soup_logger_new'
./.libs/libwebkit-1.0.so: undefined reference to `soup_message_set_request'
./.libs/libwebkit-1.0.so: undefined reference to `soup_message_get_type'
./.libs/libwebkit-1.0.so: undefined reference to `soup_message_new'
./.libs/libwebkit-1.0.so: undefined reference to `soup_message_get_uri'
./.libs/libwebkit-1.0.so: undefined reference to `soup_cookie_jar_get_cookies'
./.libs/libwebkit-1.0.so: undefined reference to `soup_message_headers_iter_next'
./.libs/libwebkit-1.0.so: undefined reference to `soup_session_cancel_message'
./.libs/libwebkit-1.0.so: undefined reference to `soup_uri_to_string'
./.libs/libwebkit-1.0.so: undefined reference to `soup_logger_get_type'
./.libs/libwebkit-1.0.so: undefined reference to `soup_message_set_uri'
./.libs/libwebkit-1.0.so: undefined reference to `soup_buffer_new_with_owner'
./.libs/libwebkit-1.0.so: undefined reference to `soup_session_add_feature'
./.libs/libwebkit-1.0.so: undefined reference to `soup_message_headers_get_content_type'
./.libs/libwebkit-1.0.so: undefined reference to `soup_session_async_new'
./.libs/libwebkit-1.0.so: undefined reference to `soup_auth_authenticate'
./.libs/libwebkit-1.0.so: undefined reference to `soup_message_headers_get'
./.libs/libwebkit-1.0.so: undefined reference to `_SOUP_URI_SCHEME_HTTPS'
./.libs/libwebkit-1.0.so: undefined reference to `soup_message_body_append_buffer'
./.libs/libwebkit-1.0.so: undefined reference to `soup_session_feature_get_type'
./.libs/libwebkit-1.0.so: undefined reference to `soup_cookie_jar_get_type'
collect2: ld returned 1 exit status
make[1]: *** [Programs/DumpRenderTree] Error 1
make[1]: Leaving directory `/home/kc1di/packaging/webkit/1.1.3/tmp/webkit-1.1.3'
make: *** [all] Error
Logged

Dave
( Living Somewhere in Maine USA)
Registered Linux User #462608
Pages: 1 [2]
  Print  
 
Jump to:  

Powered by MySQL Powered by PHP Powered by SMF 1.1.19 | SMF © 2013, Simple Machines Valid XHTML 1.0! Valid CSS!